Reaction Details
TargetUrokinase-type plasminogen activator
LigandBDBM50014341
Substrate/Competitorn/a
Meas. Tech.ChEMBL_213296 (CHEMBL814351)
Ki 744732±n/a nM
Citation Yang, HHenkin, JKim, KHGreer, J Selective inhibition of urokinase by substituted phenylguanidines: quantitative structure-activity relationship analyses. J Med Chem33:2956-61 (1990) Urokinase-type plasminogen activator
Name:Urokinase-type plasminogen activator
Type:Enzyme
Mol. Mass.:48528.62
Organism:Homo sapiens (Human)
Description:P00749
Residue:431
BDBM50014341
NameBDBM50014341
Synonyms:4-amino(immino)methylaminobenzoate
TypeSmall organic molecule
Emp. Form.C8H9N3O2
Mol. Mass.179.176
SMILESNC(=[NH2+])Nc1ccc(cc1)C([O-])=O