Reaction Details
TargetSerine protease 1
LigandBDBM16128
Substrate/Competitorn/a
Meas. Tech.ChEMBL_212532 (CHEMBL815752)
Ki 63100±n/a nM
Citation Yang, HHenkin, JKim, KHGreer, J Selective inhibition of urokinase by substituted phenylguanidines: quantitative structure-activity relationship analyses. J Med Chem33:2956-61 (1990) Serine protease 1
Name:Serine protease 1
Type:Enzyme
Mol. Mass.:25790.52
Organism:Bos taurus (bovine)
Description:P00760
Residue:246
BDBM16128
NameBDBM16128
Synonyms:4-(trifluoromethyl)benzene-1-guanidine phenylguanidine 2
TypeSmall organic molecule
Emp. Form.C8H8F3N3
Mol. Mass.203.1644
SMILESNC(=N)Nc1ccc(cc1)C(F)(F)F