Reaction Details
TargetUrokinase-type plasminogen activator
LigandBDBM16128
Substrate/Competitorn/a
Meas. Tech.ChEBML_213160
Ki 6486±n/a nM
Citation Yang, HHenkin, JKim, KHGreer, J Selective inhibition of urokinase by substituted phenylguanidines: quantitative structure-activity relationship analyses. J Med Chem33:2956-61 (1990) Urokinase-type plasminogen activator
Name:Urokinase-type plasminogen activator
Type:Enzyme
Mol. Mass.:48528.62
Organism:Homo sapiens (Human)
Description:P00749
Residue:431
BDBM16128
NameBDBM16128
Synonyms:4-(trifluoromethyl)benzene-1-guanidine phenylguanidine 2
TypeSmall organic molecule
Emp. Form.C8H8F3N3
Mol. Mass.203.1644
SMILESNC(=N)Nc1ccc(cc1)C(F)(F)F