Reaction Details
TargetUrokinase-type plasminogen activator
LigandBDBM50053620
Substrate/Competitorn/a
Meas. Tech.ChEBML_213160
Ki 20606±n/a nM
Citation Yang, HHenkin, JKim, KHGreer, J Selective inhibition of urokinase by substituted phenylguanidines: quantitative structure-activity relationship analyses. J Med Chem33:2956-61 (1990) Urokinase-type plasminogen activator
Name:Urokinase-type plasminogen activator
Type:Enzyme
Mol. Mass.:48528.62
Organism:Homo sapiens (Human)
Description:P00749
Residue:431
BDBM50053620
NameBDBM50053620
Synonyms:1-phenylguanidine CHEMBL14047 N-phenylguanidine
TypeSmall organic molecule
Emp. Form.C7H9N3
Mol. Mass.135.1665
SMILES[#7]\[#6](-[#7])=[#7]\c1ccccc1