Reaction Details
TargetSerine protease 1
LigandBDBM50014341
Substrate/Competitorn/a
Meas. Tech.ChEBML_212532
Ki 10000000±n/a nM
Citation Yang, HHenkin, JKim, KHGreer, J Selective inhibition of urokinase by substituted phenylguanidines: quantitative structure-activity relationship analyses. J Med Chem33:2956-61 (1990) Serine protease 1
Name:Serine protease 1
Type:Enzyme
Mol. Mass.:25790.52
Organism:Bos taurus (bovine)
Description:P00760
Residue:246
BDBM50014341
NameBDBM50014341
Synonyms:4-amino(immino)methylaminobenzoate
TypeSmall organic molecule
Emp. Form.C8H9N3O2
Mol. Mass.179.176
SMILESNC(=[NH2+])Nc1ccc(cc1)C([O-])=O