Reaction Details
TargetUrokinase-type plasminogen activator
LigandBDBM50014340
Substrate/Competitorn/a
Meas. Tech.ChEBML_213160
Ki 136000±n/a nM
Citation Yang, HHenkin, JKim, KHGreer, J Selective inhibition of urokinase by substituted phenylguanidines: quantitative structure-activity relationship analyses. J Med Chem33:2956-61 (1990) Urokinase-type plasminogen activator
Name:Urokinase-type plasminogen activator
Type:Enzyme
Mol. Mass.:48528.62
Organism:Homo sapiens (Human)
Description:P00749
Residue:431
BDBM50014340
NameBDBM50014340
Synonyms:1N-amino(immino)methyl-2-methoxyaniline
TypeSmall organic molecule
Emp. Form.C8H12N3O
Mol. Mass.166.1998
SMILESCOc1ccccc1NC(N)=[NH2+]