Reaction Details
TargetThromboxane-A synthase
LigandBDBM50368037
Substrate/Competitorn/a
Meas. Tech.ChEMBL_209952 (CHEMBL820608)
IC50 2300±n/a nM
Citation Archibald, JLBradley, GOpalko, AWard, TJWhite, JCEnnis, CShepperson, NB Design of an antithrombotic-antihypertensive agent (Wy 27569). Synthesis and evaluation of a series of 2-heteroaryl-substituted dihydropyridines. J Med Chem33:646-52 (1990) Thromboxane-A synthase
Name:Thromboxane-A synthase
Type:Enzyme
Mol. Mass.:60524.67
Organism:Homo sapiens (Human)
Description:P24557
Residue:533
BDBM50368037
NameBDBM50368037
Synonyms:CHEMBL1744226
TypeSmall organic molecule
Emp. Form.C23H26N4O6
Mol. Mass.454.4757
SMILESCCOC(=O)C1C(C(C(=O)OCC)=C(CCn2ccnc2)N=C1C)c1ccccc1[N+]([O-])=O