Reaction Details
TargetThromboxane-A synthase
LigandBDBM50368044
Substrate/Competitorn/a
Meas. Tech.ChEBML_210101
IC50 23000±n/a nM
Citation Archibald, JLBradley, GOpalko, AWard, TJWhite, JCEnnis, CShepperson, NB Design of an antithrombotic-antihypertensive agent (Wy 27569). Synthesis and evaluation of a series of 2-heteroaryl-substituted dihydropyridines. J Med Chem33:646-52 (1990) Thromboxane-A synthase
Name:Thromboxane-A synthase
Type:Enzyme
Mol. Mass.:60524.67
Organism:Homo sapiens (Human)
Description:P24557
Residue:533
BDBM50368044
NameBDBM50368044
Synonyms:CHEMBL1203649
TypeSmall organic molecule
Emp. Form.C24H28N4O6
Mol. Mass.468.5023
SMILESCCOC(=O)C1=C(Cn2ccnc2)N=C(C)C(C1c1cccc(c1)[N+]([O-])=O)C(=O)OC(C)(C)C