Reaction Details
TargetSerine protease 1
LigandBDBM45440
Substrate/Competitorn/a
Meas. Tech.ChEBML_213083
Ki 2300±n/a nM
Citation Tidwell, RRJones, SKGeratz, JDOhemeng, KACory, MHall, JE Analogues of 1,5-bis(4-amidinophenoxy)pentane (pentamidine) in the treatment of experimental Pneumocystis carinii pneumonia. J Med Chem33:1252-7 (1990) Serine protease 1
Name:Serine protease 1
Type:Enzyme
Mol. Mass.:26557.80
Organism:Homo sapiens (Human)
Description:P07477
Residue:247
BDBM45440
NameBDBM45440
Synonyms:4-[5-(4-amidinophenoxy)pentoxy]benzamidine;2-hydroxyethanesulfonic acid 4-[5-(4-carbamimidoylphenoxy)pentoxy]benzenecarboximidamide;2-oxidanylethanesulfonic acid MLS000028738 PENTAMIDINE ISETHIONATE cid_359323
TypeSmall organic molecule
Emp. Form.C19H24N4O2
Mol. Mass.340.4195
SMILESNC(=N)c1ccc(OCCCCCOc2ccc(cc2)C(N)=N)cc1