Reaction Details
TargetAngiotensin-converting enzyme
LigandBDBM21642
Substrate/Competitorn/a
Meas. Tech.ChEMBL_35061 (CHEMBL648935)
IC50 18±n/a nM
Citation Mencel, JJRegan, JRBarton, JMenard, PRBruno, JGCalvo, RRKornberg, BESchwab, ANeiss, ESSuh, JT Angiotensin converting enzyme inhibitors. 10. Aryl sulfonamide substituted N-[1-carboxy-3-phenylpropyl]-L-alanyl-L-proline derivatives as novel antihypertensives. J Med Chem33:1606-15 (1990) Angiotensin-converting enzyme
Name:Angiotensin-converting enzyme
Type:n/a
Mol. Mass.:150405.15
Organism:Oryctolagus cuniculus
Description:n/a
Residue:1310
BDBM21642
NameBDBM21642
Synonyms:(2S)-1-[(2S)-2-methyl-3-sulfanylpropanoyl]pyrrolidine-2-carboxylic acid Capozide Lopirin SQ14534 | US11491146, Compound L-Captopril
TypeSmall organic molecule
Emp. Form.C9H15NO3S
Mol. Mass.217.285
SMILESC[C@H](CS)C(=O)N1CCC[C@H]1C(O)=O