Reaction Details
TargetDelta-type opioid receptor
LigandBDBM50006946
Substrate/Competitorn/a
Meas. Tech.ChEMBL_146439 (CHEMBL757336)
Ki 35±n/a nM
Citation Portoghese, PSSultana, MTakemori, AE Design of peptidomimetic delta opioid receptor antagonists using the message-address concept. J Med Chem33:1714-20 (1990) Delta-type opioid receptor
Name:Delta-type opioid receptor
Type:G Protein-Coupled Receptor (GPCR)
Mol. Mass.:40382.98
Organism:Homo sapiens (Human)
Description:Competition binding assays were carried out using membrane preparations from transfected HN9.10 cells that constitutively expressed the delta opioid receptor.
Residue:372
BDBM50006946
NameBDBM50006946
Synonyms:2-[2-(2-{2-[2-Diallylamino-3-(4-hydroxy-phenyl)-propionylamino]-2-methyl-propionylamino}-2-methyl-propionylamino)-3-phenyl-propionylamino]-4-methyl-pentanoic acid ICI-174864
TypeSmall organic molecule
Emp. Form.C38H53N5O7
Mol. Mass.691.8567
SMILESCC(C)C[C@H](NC(=O)[C@H](Cc1ccccc1)NC(=O)C(C)(C)NC(=O)C(C)(C)NC(=O)[C@H](Cc1ccc(O)cc1)N(CC=C)CC=C)C(O)=O