Reaction Details
TargetAdenosine receptor A2a/A2b
LigandBDBM50015651
Substrate/Competitorn/a
Meas. Tech.ChEMBL_30721 (CHEMBL646487)
Ki 71±n/a nM
Citation Hutchison, AJWilliams, Mde Jesus, RYokoyama, ROei, HHGhai, GRWebb, RLZoganas, HCStone, GAJarvis, MF 2-(Arylalkylamino)adenosin-5'-uronamides: a new class of highly selective adenosine A2 receptor ligands. J Med Chem33:1919-24 (1990) Adenosine receptor A2a/A2b
Name:Adenosine receptor A2a/A2b
Synonyms:Adenosine A2 receptor
Type:n/a
Mol. Mass.:n/a
Description:ASSAY_ID of ChEMBL is 30560
Components:This complex has 2 components.
Component 1
Name:Adenosine receptor A2b
Type:PROTEIN
Mol. Mass.:36378.84
Organism:Rattus norvegicus
Description:ChEMBL_32934
Residue:332
Component 2
Name:Adenosine receptor A2a
Synonyms:AA2AR_RAT Adenosine A2 receptor Adenosine Receptors A2a (A2a) Adenosine receptors A2a Rat striatal adenosine A2a receptor
Type:G Protein-Coupled Receptor (GPCR)
Mol. Mass.:45015.65
Organism:Rattus norvegicus (rat)
Description:Rat A2A receptors expressed in CHO cells.
Residue:410
BDBM50015651
NameBDBM50015651
Synonyms:(2S,3S,4R)-5-[(R)-6-Amino-2-(methyl-phenethyl-amino)-purin-9-yl]-3,4-dihydroxy-tetrahydro-furan-2-carboxylic acid ethylamide | CHEMBL2374463
TypeSmall organic molecule
Emp. Form.C21H27N7O4
Mol. Mass.441.4836
SMILESCCNC(=O)[C@H]1O[C@H]([C@H](O)[C@@H]1O)n1cnc2c(N)nc(nc12)N(C)CCc1ccccc1