Reaction Details
TargetAdenosine receptor A1
LigandBDBM50015650
Substrate/Competitorn/a
Meas. Tech.ChEBML_28846
Ki 4250±n/a nM
Citation Hutchison, AJWilliams, Mde Jesus, RYokoyama, ROei, HHGhai, GRWebb, RLZoganas, HCStone, GAJarvis, MF 2-(Arylalkylamino)adenosin-5'-uronamides: a new class of highly selective adenosine A2 receptor ligands. J Med Chem33:1919-24 (1990) Adenosine receptor A1
Name:Adenosine receptor A1
Type:Protein
Mol. Mass.:36704.13
Organism:Rattus norvegicus (rat)
Description:n/a
Residue:326
BDBM50015650
NameBDBM50015650
Synonyms:(4-{2-[(R)-6-Amino-9-((3R,4S,5S)-5-ethylcarbamoyl-3,4-dihydroxy-tetrahydro-furan-2-yl)-9H-purin-2-ylamino]-ethyl}-phenoxy)-acetic acid CHEMBL60860
TypeSmall organic molecule
Emp. Form.C22H27N7O7
Mol. Mass.501.4925
SMILESCCNC(=O)[C@H]1OC([C@H](O)[C@@H]1O)n1cnc2c(N)nc(NCCc3ccc(OCC(O)=O)cc3)nc12