Reaction Details
TargetAdenosine receptor A1
LigandBDBM50094569
Substrate/Competitorn/a
Meas. Tech.ChEBML_28846
Ki 1.3±n/a nM
Citation Hutchison, AJWilliams, Mde Jesus, RYokoyama, ROei, HHGhai, GRWebb, RLZoganas, HCStone, GAJarvis, MF 2-(Arylalkylamino)adenosin-5'-uronamides: a new class of highly selective adenosine A2 receptor ligands. J Med Chem33:1919-24 (1990) Adenosine receptor A1
Name:Adenosine receptor A1
Type:Protein
Mol. Mass.:36704.13
Organism:Rattus norvegicus (rat)
Description:n/a
Residue:326
BDBM50094569
NameBDBM50094569
Synonyms:6-chloro-3,20-dioxo-1beta,2beta-dihydro-3'H-cyclopropa[1,2]pregna-4,6-dien-17-yl acetate Cyproterone 17-O-acetate cyproterone acetate
TypeSmall organic molecule
Emp. Form.C24H29ClO4
Mol. Mass.416.938
SMILESCC(=O)O[C@@]1(CC[C@H]2[C@@H]3C=C(Cl)C4=CC(=O)[C@@H]5C[C@@H]5[C@]4(C)[C@H]3CC[C@]12C)C(C)=O