Reaction Details
TargetOxytocin receptor
LigandBDBM50368134
Substrate/Competitorn/a
Meas. Tech.ChEBML_149183
Ki 1.1±n/a nM
Citation Bock, MGDiPardo, RMWilliams, PDPettibone, DJClineschmidt, BVBall, RGVeber, DFFreidinger, RM Receptor ligands which bind the oxytocin receptor with selectivity and high affinity. Chemical modification of a Streptomyces silvensis derived cyclic hexapeptide. J Med Chem33:2321-3 (1990) Oxytocin receptor
Name:Oxytocin receptor
Type:Enzyme Catalytic Domain
Mol. Mass.:42889.28
Organism:RAT
Description:Oxytocin OXTR RAT::P70536
Residue:388
BDBM50368134
NameBDBM50368134
Synonyms:CHEMBL1790544
TypeSmall organic molecule
Emp. Form.C40H50N8O5S
Mol. Mass.754.941
SMILESCC[C@@H](C)[C@@H]1NC(=S)[C@@H](Cc2ccccc2)NC(=O)[C@@H]2CCCN2C(=O)[C@@H](Cc2ccccc2)N(C)C(=O)[C@@H]2CCC=NN2C(=O)[C@H]2CCC=NN2C1=O