Reaction Details
TargetOxytocin receptor
LigandBDBM50368130
Substrate/Competitorn/a
Meas. Tech.ChEBML_149183
Ki 3.4±n/a nM
Citation Bock, MGDiPardo, RMWilliams, PDPettibone, DJClineschmidt, BVBall, RGVeber, DFFreidinger, RM Receptor ligands which bind the oxytocin receptor with selectivity and high affinity. Chemical modification of a Streptomyces silvensis derived cyclic hexapeptide. J Med Chem33:2321-3 (1990) Oxytocin receptor
Name:Oxytocin receptor
Type:Enzyme Catalytic Domain
Mol. Mass.:42889.28
Organism:RAT
Description:Oxytocin OXTR RAT::P70536
Residue:388
BDBM50368130
NameBDBM50368130
Synonyms:CHEMBL1790551
TypeSmall organic molecule
Emp. Form.C43H57N9O6
Mol. Mass.795.9694
SMILESCC[C@@H](C)[C@@H]1NC(=O)[C@@H](Cc2ccccc2)NC(=O)[C@@H]2CCCN2C(=O)[C@@H](Cc2ccccc2)N(C)C(=O)[C@@H]2C[C@@H](CN(C)C)C=NN2C(=O)[C@H]2CCC=NN2C1=O