Reaction Details
TargetD(2) dopamine receptor
LigandBDBM81986
Substrate/Competitorn/a
Meas. Tech.ChEMBL_58217 (CHEMBL872494)
Ki 1900±n/a nM
Citation Neumeyer, JLBaindur, NNiznik, HBGuan, HCSeeman, P (+/-)-3-Allyl-6-bromo-7,8-dihydroxy-1-phenyl-2,3,4,5-tetrahydro-1H-3- benzazepin, a new high-affinity D1 dopamine receptor ligand: synthesis and structure-activity relationship. J Med Chem34:3366-71 (1992) D(2) dopamine receptor
Name:D(2) dopamine receptor
Type:Cell-surface receptors
Mol. Mass.:50647.10
Organism:Homo sapiens (Human)
Description:P14416
Residue:443
BDBM81986
NameBDBM81986
Synonyms:3-Methyl-1-phenyl-2,3,4,5-tetrahydro-1H-benzo[d]azepine-7,8-diol; hydrochloride CHEMBL545000 SKF 75670
TypeSmall organic molecule
Emp. Form.C17H19NO2
Mol. Mass.269.3383
SMILESCN1CCc2cc(O)c(O)cc2C(C1)c1ccccc1