Reaction Details
TargetAdenosylhomocysteinase
LigandBDBM50011352
Substrate/Competitorn/a
Meas. Tech.ChEMBL_196879 (CHEMBL807531)
Ki 150000±n/a nM
Citation Jarvi, ETMcCarthy, JRMehdi, SMatthews, DPEdwards, MLPrakash, NJBowlin, TLSunkara, PSBey, P 4',5'-unsaturated 5'-halogenated nucleosides. Mechanism-based and competitive inhibitors of S-adenosyl-L-homocysteine hydrolase. J Med Chem34:647-56 (1991) Adenosylhomocysteinase
Name:Adenosylhomocysteinase
Type:PROTEIN
Mol. Mass.:47537.52
Organism:Rattus norvegicus
Description:ChEMBL_1507790
Residue:432
BDBM50011352
NameBDBM50011352
Synonyms:5-(6-Amino-purin-9-yl)-2-fluoromethylene-tetrahydro-furan-3-ol | CHEMBL3349335
TypeSmall organic molecule
Emp. Form.C10H10FN5O2
Mol. Mass.251.2171
SMILESNc1ncnc2n(cnc12)[C@H]1C[C@H](O)\C(O1)=C\F