Reaction Details
TargetAromatase
LigandBDBM8611
Substrate/Competitorn/a
Meas. Tech.ChEMBL_82061 (CHEMBL696208)
IC50 0.030000±n/a nM
Citation Browne, LJGude, CRodriguez, HSteele, REBhatnager, A Fadrozole hydrochloride: a potent, selective, nonsteroidal inhibitor of aromatase for the treatment of estrogen-dependent disease. J Med Chem34:725-36 (1991) Aromatase
Name:Aromatase
Type:Enzyme
Mol. Mass.:57888.92
Organism:Homo sapiens (Human)
Description:P11511
Residue:503
BDBM8611
NameBDBM8611
Synonyms:4-{5H,6H,7H,8H-imidazo[1,5-a]pyridin-5-yl}benzonitrile CHEMBL9298 US9271963, Fadrozole
TypeSmall organic molecule
Emp. Form.C14H13N3
Mol. Mass.223.2731
SMILESN#Cc1ccc(cc1)C1CCCc2cncn12