Reaction Details
TargetAcetylcholinesterase
LigandBDBM50368271
Substrate/Competitorn/a
Meas. Tech.ChEBML_27815
IC50 3±n/a nM
Citation Cannon, JGSahin, MFBhatnagar, RKFlynn, JRLong, JP Structure-activity studies on a potent antagonist to organophosphate-induced toxicity. J Med Chem34:1582-4 (1991) Acetylcholinesterase
Name:Acetylcholinesterase
Type:Enzyme
Mol. Mass.:67659.62
Organism:Bos taurus (bovine)
Description:n/a
Residue:613
BDBM50368271
NameBDBM50368271
Synonyms:CHEMBL1204112
TypeSmall organic molecule
Emp. Form.C30H42N2O6
Mol. Mass.526.6632
SMILESC[N+](C)(CC1OCCCO1)CC(=O)c1ccc(cc1)-c1ccc(cc1)C(=O)C[N+](C)(C)CC1OCCCO1