Reaction Details
TargetMu-type opioid receptor
LigandBDBM50006946
Substrate/Competitorn/a
Meas. Tech.ChEMBL_145287 (CHEMBL752956)
Ki>1000±n/a nM
Citation Portoghese, PS An approach to the design of receptor-type-selective non-peptide antagonists of peptidergic receptors: delta opioid antagonists. J Med Chem34:1757-62 (1991) Mu-type opioid receptor
Name:Mu-type opioid receptor
Type:Enzyme Catalytic Domain
Mol. Mass.:11165.58
Organism:GUINEA PIG
Description:P97266
Residue:98
BDBM50006946
NameBDBM50006946
Synonyms:2-[2-(2-{2-[2-Diallylamino-3-(4-hydroxy-phenyl)-propionylamino]-2-methyl-propionylamino}-2-methyl-propionylamino)-3-phenyl-propionylamino]-4-methyl-pentanoic acid ICI-174864
TypeSmall organic molecule
Emp. Form.C38H53N5O7
Mol. Mass.691.8567
SMILESCC(C)C[C@H](NC(=O)[C@H](Cc1ccccc1)NC(=O)C(C)(C)NC(=O)C(C)(C)NC(=O)[C@H](Cc1ccc(O)cc1)N(CC=C)CC=C)C(O)=O