Reaction Details
TargetGag-Pol polyprotein [489-587]
LigandBDBM50009248
Substrate/Competitorn/a
Meas. Tech.ChEMBL_159775 (CHEMBL763100)
IC50 2500±n/a nM
Citation Huff, JR HIV protease: a novel chemotherapeutic target for AIDS. J Med Chem34:2305-14 (1991) Gag-Pol polyprotein [489-587]
Name:Gag-Pol polyprotein [489-587]
Type:Enzyme Subunit
Mol. Mass.:10781.16
Organism:Human immunodeficiency virus type 1
Description:P04585[489-587]
Residue:99
BDBM50009248
NameBDBM50009248
Synonyms:(2R,3S)-3-((4E,7E)-Nona-4,7-dienoyl)-oxirane-2-carboxylic acid amide 3-Nona-4,7-dienoyl-oxirane-2-carboxylic acid amide CERULENIN | CHEMBL45627
TypeSmall organic molecule
Emp. Form.C12H17NO3
Mol. Mass.223.2683
SMILESC\C=C\C\C=C\CCC(=O)[C@H]1O[C@H]1C(N)=O