Reaction Details
TargetGenome polyprotein
LigandBDBM50009248
Substrate/Competitorn/a
Meas. Tech.ChEMBL_158063 (CHEMBL764892)
IC50 2500000±n/a nM
Citation Huff, JR HIV protease: a novel chemotherapeutic target for AIDS. J Med Chem34:2305-14 (1991) Genome polyprotein
Name:Genome polyprotein
Type:PROTEIN
Mol. Mass.:44361.04
Organism:Human rhinovirus B
Description:ChEMBL_158953
Residue:401
BDBM50009248
NameBDBM50009248
Synonyms:(2R,3S)-3-((4E,7E)-Nona-4,7-dienoyl)-oxirane-2-carboxylic acid amide 3-Nona-4,7-dienoyl-oxirane-2-carboxylic acid amide CERULENIN | CHEMBL45627
TypeSmall organic molecule
Emp. Form.C12H17NO3
Mol. Mass.223.2683
SMILESC\C=C\C\C=C\CCC(=O)[C@H]1O[C@H]1C(N)=O