Reaction Details
TargetProtein kinase C alpha/beta/gamma type
LigandBDBM50009723
Substrate/Competitorn/a
Meas. Tech.ChEBML_162244
IC50 20000±n/a nM
Citation Shearer, BGSullivan, JPCarter, JPMathew, RMWaid, PConnor, JRPatch, RJBurch, RM Substituted 2-(aminomethyl)piperidines: a novel class of selective protein kinase C inhibitors. J Med Chem34:2928-31 (1991) Protein kinase C alpha/beta/gamma type
Name:Protein kinase C alpha/beta/gamma type
Synonyms:Protein kinase C, PKC; classical
Type:n/a
Mol. Mass.:n/a
Description:ASSAY_ID of ChEMBL is 162381
Components:This complex has 3 components.
Component 1
Name:Protein kinase C alpha type
Type:Protein
Mol. Mass.:76797.67
Organism:Rattus norvegicus (Rat)
Description:P05696
Residue:672
Component 2
Name:Protein kinase C beta type
Synonyms:KPCB_RAT Pkcb Prkcb1 Protein kinase C (PKC) | Protein kinase C beta
Type:Enzyme Mixture
Mol. Mass.:76755.54
Organism:Rattus norvegicus (rat)
Description:PKC from rat brain is known to contain predominately the conventional PKC isoforms, alpha, beta I, beta II, gamma.
Residue:671
Component 3
Name:Protein kinase C gamma type
Synonyms:KPCG_RAT Pkcg Prkcg Protein kinase C gamma
Type:PROTEIN
Mol. Mass.:78367.88
Organism:Rattus norvegicus
Description:ChEMBL_152979
Residue:697
BDBM50009723
NameBDBM50009723
Synonyms:2,6-Diamino-hexanoic acid (1-tridecanoyl-piperidin-2-ylmethyl)-amide | CHEMBL329705
TypeSmall organic molecule
Emp. Form.C25H50N4O2
Mol. Mass.438.6901
SMILESCCCCCCCCCCCCC(=O)N1CCCCC1CNC(=O)[C@@H](N)CCCCN