Reaction Details
TargetHistamine H1 receptor
LigandBDBM50002102
Substrate/Competitorn/a
Meas. Tech.ChEMBL_83429 (CHEMBL878194)
Ki 0.630000±n/a nM
Citation Ohshima, EOtaki, SSato, HKumazawa, TObase, HIshii, AIshii, HOhmori, KHirayama, N Synthesis and antiallergic activity of 11-(aminoalkylidene)-6,11-dihydrodibenz[b,e]oxepin derivatives. J Med Chem35:2074-84 (1992) Histamine H1 receptor
Name:Histamine H1 receptor
Type:G Protein-Coupled Receptor (GPCR)
Mol. Mass.:55641.53
Organism:Cavia porcellus (domestic guinea pig)
Description:Guinea pig cerebellum was used in binding assay.
Residue:488
BDBM50002102
NameBDBM50002102
Synonyms:2-[11-(3-Dimethylamino-propylidene)-6,11-dihydro-dibenzo[b,e]oxepin-2-yl]-ethanol | CHEMBL294777
TypeSmall organic molecule
Emp. Form.C21H25NO2
Mol. Mass.323.4287
SMILESCN(C)CC\C=C1\c2ccccc2COc2ccc(CCO)cc12