Reaction Details
TargetHistamine H1 receptor
LigandBDBM50002096
Substrate/Competitorn/a
Meas. Tech.ChEBML_83429
Ki 16±n/a nM
Citation Ohshima, EOtaki, SSato, HKumazawa, TObase, HIshii, AIshii, HOhmori, KHirayama, N Synthesis and antiallergic activity of 11-(aminoalkylidene)-6,11-dihydrodibenz[b,e]oxepin derivatives. J Med Chem35:2074-84 (1992) Histamine H1 receptor
Name:Histamine H1 receptor
Type:G Protein-Coupled Receptor (GPCR)
Mol. Mass.:55641.53
Organism:Cavia porcellus (domestic guinea pig)
Description:Guinea pig cerebellum was used in binding assay.
Residue:488
BDBM50002096
NameBDBM50002096
Synonyms:ALO-4943A KW-4679 Olopatadine Patanol | [11-(3-Dimethylamino-propylidene)-6,11-dihydro-dibenzo[b,e]oxepin-2-yl]-acetic acid; hydrochloride
TypeSmall organic molecule
Emp. Form.C21H23NO3
Mol. Mass.337.4122
SMILESCN(C)CC\C=C1\c2ccccc2COc2ccc(CC(O)=O)cc12