Reaction Details
TargetHistamine H1 receptor
LigandBDBM50002098
Substrate/Competitorn/a
Meas. Tech.ChEBML_83429
Ki 6.3±n/a nM
Citation Ohshima, EOtaki, SSato, HKumazawa, TObase, HIshii, AIshii, HOhmori, KHirayama, N Synthesis and antiallergic activity of 11-(aminoalkylidene)-6,11-dihydrodibenz[b,e]oxepin derivatives. J Med Chem35:2074-84 (1992) Histamine H1 receptor
Name:Histamine H1 receptor
Type:G Protein-Coupled Receptor (GPCR)
Mol. Mass.:55641.53
Organism:Cavia porcellus (domestic guinea pig)
Description:Guinea pig cerebellum was used in binding assay.
Residue:488
BDBM50002098
NameBDBM50002098
Synonyms:11-(4-Dimethylamino-butylidene)-6,11-dihydro-dibenzo[b,e]oxepine-2-carboxylic acid | CHEMBL304042
TypeSmall organic molecule
Emp. Form.C21H23NO3
Mol. Mass.337.4122
SMILESCN(C)CCC\C=C1/c2ccccc2COc2ccc(cc12)C(O)=O