Reaction Details
TargetHistamine H1 receptor
LigandBDBM50002095
Substrate/Competitorn/a
Meas. Tech.ChEBML_83429
Ki 4.2±n/a nM
Citation Ohshima, EOtaki, SSato, HKumazawa, TObase, HIshii, AIshii, HOhmori, KHirayama, N Synthesis and antiallergic activity of 11-(aminoalkylidene)-6,11-dihydrodibenz[b,e]oxepin derivatives. J Med Chem35:2074-84 (1992) Histamine H1 receptor
Name:Histamine H1 receptor
Type:G Protein-Coupled Receptor (GPCR)
Mol. Mass.:55641.53
Organism:Cavia porcellus (domestic guinea pig)
Description:Guinea pig cerebellum was used in binding assay.
Residue:488
BDBM50002095
NameBDBM50002095
Synonyms:11-(3-Dimethylamino-propylidene)-6,11-dihydro-dibenzo[b,e]oxepine-2-carboxylic acid; compound with but-2-enedioic acid | CHEMBL65822
TypeSmall organic molecule
Emp. Form.C20H21NO3
Mol. Mass.323.3856
SMILESCN(C)CC\C=C1/c2ccccc2COc2ccc(cc12)C(O)=O