Reaction Details
TargetVoltage-dependent L-type calcium channel subunit alpha-1C
LigandBDBM50002644
Substrate/Competitorn/a
Meas. Tech.ChEBML_164619
IC50 1.4±n/a nM
Citation Sunkel, CEFau de Casa-Juana, MSantos, LGarcía, AGArtalejo, CRVillarroya, MGonzález-Morales, MALópez, MGCillero, JAlonso, S Synthesis of 3-[(2,3-dihydro-1,1,3-trioxo-1,2-benzisothiazol-2-yl)alkyl] 1,4-dihydropyridine-3,5-dicarboxylate derivatives as calcium channel modulators. J Med Chem35:2407-14 (1992) Voltage-dependent L-type calcium channel subunit alpha-1C
Name:Voltage-dependent L-type calcium channel subunit alpha-1C
Type:PROTEIN
Mol. Mass.:242793.78
Organism:Oryctolagus cuniculus
Description:ChEMBL_42776
Residue:2171
BDBM50002644
NameBDBM50002644
Synonyms:2,6-Dimethyl-4-(2-nitro-phenyl)-1,4-dihydro-pyridine-3,5-dicarboxylic acid 3-isopropyl ester 5-(1,1,3-trioxo-1,3-dihydro-1lambda*6*-benzo[d]isothiazol-2-ylmethyl) ester | CHEMBL78656
TypeSmall organic molecule
Emp. Form.C26H25N3O9S
Mol. Mass.555.556
SMILESCC(C)OC(=[OH+])C1=C(C)N=C(C)C(C1c1ccccc1[N+]([O-])=O)=C([O-])OCN1C(=O)c2ccccc2S1(=O)=O