Reaction Details
TargetGastrin/cholecystokinin type B receptor
LigandBDBM81962
Substrate/Competitorn/a
Meas. Tech.ChEBML_48250
IC50 5.1±n/a nM
Citation Drysdale, MJPritchard, MCHorwell, DC Rationally designed"dipeptoid" analogues of CCK. Acid mimics of the potent and selective non-peptide CCK-B receptor antagonist CI-988. J Med Chem35:2573-81 (1992) Gastrin/cholecystokinin type B receptor
Name:Gastrin/cholecystokinin type B receptor
Type:Enzyme Catalytic Domain
Mol. Mass.:49196.59
Organism:MOUSE
Description:Cholecystokinin A CCKBR MOUSE::P56481
Residue:453
BDBM81962
NameBDBM81962
Synonyms:S-L-365,260
Typen/a
Emp. Form.C24H22N4O2
Mol. Mass.398.4571
SMILESCN1c2ccccc2C(=N[C@@H](NC(=O)Nc2cccc(C)c2)C1=O)c1ccccc1