Reaction Details
TargetGag-Pol polyprotein [489-587]
LigandBDBM50004778
Substrate/Competitorn/a
Meas. Tech.ChEMBL_159305 (CHEMBL769358)
IC50>150000±n/a nM
Citation DeCamp, DLBabé, LMSalto, RLucich, JLKoo, MSKahl, SBCraik, CS Specific inhibition of HIV-1 protease by boronated porphyrins. J Med Chem35:3426-8 (1992) Gag-Pol polyprotein [489-587]
Name:Gag-Pol polyprotein [489-587]
Type:Enzyme Subunit
Mol. Mass.:10781.16
Organism:Human immunodeficiency virus type 1
Description:P04585[489-587]
Residue:99
BDBM50004778
NameBDBM50004778
Synonyms:3-[18-(2-Carboxy-ethyl)-8,13-bis-(1,2-diacetoxy-ethyl)-3,7,12,17-tetramethyl-22,24-dihydro-porphin-2-yl]-propionic acid | CHEMBL326831
TypeSmall organic molecule
Emp. Form.C50H46N4O12
Mol. Mass.894.9198
SMILESCc1c(CCC(O)=O)c2cc3nc(cc4[nH]c(cc5[nH]c(cc1n2)c(C)c5C(COC(=O)C1=CC1)OC(=O)C1=CC1)c(C)c4C(COC(=O)C1=CC1)OC(=O)C1=CC1)c(C)c3CCC(O)=O