Reaction Details
TargetGag-Pol polyprotein [489-587]
LigandBDBM51757
Substrate/Competitorn/a
Meas. Tech.ChEMBL_159305 (CHEMBL769358)
IC50>200000±n/a nM
Citation DeCamp, DLBabé, LMSalto, RLucich, JLKoo, MSKahl, SBCraik, CS Specific inhibition of HIV-1 protease by boronated porphyrins. J Med Chem35:3426-8 (1992) Gag-Pol polyprotein [489-587]
Name:Gag-Pol polyprotein [489-587]
Type:Enzyme Subunit
Mol. Mass.:10781.16
Organism:Human immunodeficiency virus type 1
Description:P04585[489-587]
Residue:99
BDBM51757
NameBDBM51757
Synonyms:3-[(1Z,4Z,9Z,15Z)-18-(2-Carboxy-ethyl)-3,7,12,17-tetramethyl-8,13-divinyl-porphyrin-2-yl]-propionic acid 3-[18-(2-carboxyethyl)-8,13-bis(ethenyl)-3,7,12,17-tetramethyl-22,23-dihydroporphyrin-2-yl]propanoic acid CHEMBL267548 PROTOPORPHYRIN IX cid_4971
TypeSmall organic molecule
Emp. Form.C34H34N4O4
Mol. Mass.562.6582
SMILESCc1c(CCC(O)=O)c2cc3nc(cc4[nH]c(cc5[nH]c(cc1n2)c(C)c5C=C)c(C)c4C=C)c(C)c3CCC(O)=O