Reaction Details
TargetGag-Pol polyprotein [489-587]
LigandBDBM50004786
Substrate/Competitorn/a
Meas. Tech.ChEBML_79800
IC50 5000±n/a nM
Citation DeCamp, DLBabé, LMSalto, RLucich, JLKoo, MSKahl, SBCraik, CS Specific inhibition of HIV-1 protease by boronated porphyrins. J Med Chem35:3426-8 (1992) Gag-Pol polyprotein [489-587]
Name:Gag-Pol polyprotein [489-587]
Type:Enzyme Subunit
Mol. Mass.:10781.16
Organism:Human immunodeficiency virus type 1
Description:P04585[489-587]
Residue:99
BDBM50004786
NameBDBM50004786
Synonyms:CHEMBL268410 | Porphyrin analogue
TypeSmall organic molecule
Emp. Form.C78H94N4O12
Mol. Mass.1279.6006
SMILESCc1c(CCC(O)=O)c2cc3nc(cc4[nH]c(cc5[nH]c(cc1n2)c(C)c5C(COC(=O)C12C[C@H]5C[C@H](C[C@H](C5)C1)C2)OC(=O)C12C[C@H]5C[C@H](C[C@H](C5)C1)C2)c(C)c4C(COC(=O)C12C[C@H]4C[C@H](C[C@H](C4)C1)C2)OC(=O)C12C[C@H]4C[C@H](C[C@H](C4)C1)C2)c(C)c3CCC(O)=O