Reaction Details
TargetAdenosine receptor A2a/A2b
LigandBDBM50368449
Substrate/Competitorn/a
Meas. Tech.ChEBML_30558
Ki<1±n/a nM
CommentsZero 12/22/2021
Citation Jacobson, KANikodijevic, OJi, XDBerkich, DAEveleth, DDean, RLHiramatsu, KKassell, NFvan Galen, PJLee, KS Synthesis and biological activity of N6-(p-sulfophenyl)alkyl and N6-sulfoalkyl derivatives of adenosine: water-soluble and peripherally selective adenosine agonists. J Med Chem35:4143-9 (1992) Adenosine receptor A2a/A2b
Name:Adenosine receptor A2a/A2b
Synonyms:Adenosine A2 receptor
Type:n/a
Mol. Mass.:n/a
Description:ASSAY_ID of ChEMBL is 30560
Components:This complex has 2 components.
Component 1
Name:Adenosine receptor A2b
Type:PROTEIN
Mol. Mass.:36378.84
Organism:Rattus norvegicus
Description:ChEMBL_32934
Residue:332
Component 2
Name:Adenosine receptor A2a
Synonyms:AA2AR_RAT Adenosine A2 receptor Adenosine Receptors A2a (A2a) Adenosine receptors A2a Rat striatal adenosine A2a receptor
Type:G Protein-Coupled Receptor (GPCR)
Mol. Mass.:45015.65
Organism:Rattus norvegicus (rat)
Description:Rat A2A receptors expressed in CHO cells.
Residue:410
BDBM50368449
NameBDBM50368449
Synonyms:CHEMBL610435
TypeSmall organic molecule
Emp. Form.C12H16N5O7S
Mol. Mass.374.35
SMILESOC[C@H]1OC([C@H](O)[C@@H]1O)n1cnc2c(NCCS([O-])(=O)=O)ncnc12