Reaction Details
TargetAdenosine receptor A1
LigandBDBM42467
Substrate/Competitorn/a
Meas. Tech.ChEBML_28979
Ki 3.5±n/a nM
Citation Jacobson, KANikodijevic, OJi, XDBerkich, DAEveleth, DDean, RLHiramatsu, KKassell, NFvan Galen, PJLee, KS Synthesis and biological activity of N6-(p-sulfophenyl)alkyl and N6-sulfoalkyl derivatives of adenosine: water-soluble and peripherally selective adenosine agonists. J Med Chem35:4143-9 (1992) Adenosine receptor A1
Name:Adenosine receptor A1
Type:Protein
Mol. Mass.:36704.13
Organism:Rattus norvegicus (rat)
Description:n/a
Residue:326
BDBM42467
NameBDBM42467
Synonyms:(2R,3R,4S,5R)-2-(6-anilino-9-purinyl)-5-(hydroxymethyl)oxolane-3,4-diol (2R,3R,4S,5R)-2-(6-anilinopurin-9-yl)-5-methylol-tetrahydrofuran-3,4-diol MLS000069355 N6-PHENYLADENOSINE cid_101430
TypeSmall organic molecule
Emp. Form.C16H17N5O4
Mol. Mass.343.3373
SMILESOC[C@H]1O[C@H]([C@H](O)[C@@H]1O)n1cnc2c(Nc3ccccc3)ncnc12