Reaction Details
Target5-hydroxytryptamine receptor 3A/3B
LigandBDBM50000482
Substrate/Competitorn/a
Meas. Tech.ChEMBL_2987 (CHEMBL621504)
Ki 0.890000±n/a nM
Citation Youssefyeh, RDCampbell, HFKlein, SAirey, JEDarkes, PPowers, MSchnapper, MNeuenschwander, KFitzpatrick, LRPendley, CE Development of high-affinity 5-HT3 receptor antagonists. 1. Initial structure-activity relationship of novel benzamides. J Med Chem35:895-903 (1992) 5-hydroxytryptamine receptor 3A/3B
Name:5-hydroxytryptamine receptor 3A/3B
Type:n/a
Mol. Mass.:n/a
Description:ASSAY_ID of EBI is 2974
Components:This complex has 2 components.
Component 1
Name:5-hydroxytryptamine receptor 3B
Synonyms:5HT3B_RAT Serotonin (5-HT) receptor
Type:PROTEIN
Mol. Mass.:50328.78
Organism:Rattus norvegicus
Description:EBI_11885
Residue:437
Component 2
Name:5-hydroxytryptamine receptor 3A
Synonyms:5-HT3 5HT3A_RAT Htr3 Serotonin (5-HT) receptor | Zacopride site-R
Type:Enzyme Catalytic Domain
Mol. Mass.:55428.70
Organism:RAT
Description:5-HT3 HTR3A RAT::P35563
Residue:483
BDBM50000482
NameBDBM50000482
Synonyms:(R)-2-(5-chlorospiro[2,3-dihydrobenzo[b]furan-2,1'-cyclohexane]-6-ylcarboxamido)-4-azabicyclo[2.2.2]octane | CHEMBL352411
TypeSmall organic molecule
Emp. Form.C21H27ClN2O2
Mol. Mass.374.904
SMILESClc1cc2CC3(CCCCC3)Oc2c(c1)C(=O)N[C@H]1CN2CCC1CC2