Reaction Details
TargetDihydrofolate reductase
LigandBDBM50005860
Substrate/Competitorn/a
Meas. Tech.ChEBML_54097
IC50 950000±n/a nM
Citation Rosowsky, AForsch, RAReich, VEFreisheim, JHMoran, RG Side chain modified 5-deazafolate and 5-deazatetrahydrofolate analogues as mammalian folylpolyglutamate synthetase and glycinamide ribonucleotide formyltransferase inhibitors: synthesis and in vitro biological evaluation. J Med Chem35:1578-88 (1992) Dihydrofolate reductase
Name:Dihydrofolate reductase
Type:Enzyme
Mol. Mass.:21453.99
Organism:Homo sapiens (Human)
Description:Recombinant human DHFR.
Residue:187
BDBM50005860
NameBDBM50005860
Synonyms:2-{4-[(2-Amino-4-oxo-3,4,5,6,7,8-hexahydro-pyrido[2,3-d]pyrimidin-6-ylmethyl)-amino]-benzoylamino}-4-(ethoxy-hydroxy-phosphoryl)-butyric acid | CHEMBL41459
TypeSmall organic molecule
Emp. Form.C21H29N6O7P
Mol. Mass.508.4647
SMILESCCOP(O)(=O)CCC(NC(=O)c1ccc(NCC2CNc3nc(N)[nH]c(=O)c3C2)cc1)C(O)=O