Reaction Details
TargetFolylpolyglutamate synthase, mitochondrial
LigandBDBM50005865
Substrate/Competitorn/a
Meas. Tech.ChEBML_68543
Ki 22000±n/a nM
Citation Rosowsky, AForsch, RAReich, VEFreisheim, JHMoran, RG Side chain modified 5-deazafolate and 5-deazatetrahydrofolate analogues as mammalian folylpolyglutamate synthetase and glycinamide ribonucleotide formyltransferase inhibitors: synthesis and in vitro biological evaluation. J Med Chem35:1578-88 (1992) Folylpolyglutamate synthase, mitochondrial
Name:Folylpolyglutamate synthase, mitochondrial
Type:PROTEIN
Mol. Mass.:64969.76
Organism:Mus musculus
Description:ChEMBL_68680
Residue:587
BDBM50005865
NameBDBM50005865
Synonyms:2-{4-[(2-Amino-4-oxo-3,4,5,6,7,8-hexahydro-pyrido[2,3-d]pyrimidin-6-ylmethyl)-amino]-benzoylamino}-4-sulfo-butyric acid | CHEMBL417696
TypeSmall organic molecule
Emp. Form.C19H24N6O7S
Mol. Mass.480.495
SMILESNc1nc2NCC(CNc3ccc(cc3)C(=O)NC(CCS(O)(=O)=O)C(O)=O)Cc2c(=O)[nH]1