Reaction Details
TargetFolylpolyglutamate synthase, mitochondrial
LigandBDBM50005863
Substrate/Competitorn/a
Meas. Tech.ChEBML_68543
Ki 570000±n/a nM
Citation Rosowsky, AForsch, RAReich, VEFreisheim, JHMoran, RG Side chain modified 5-deazafolate and 5-deazatetrahydrofolate analogues as mammalian folylpolyglutamate synthetase and glycinamide ribonucleotide formyltransferase inhibitors: synthesis and in vitro biological evaluation. J Med Chem35:1578-88 (1992) Folylpolyglutamate synthase, mitochondrial
Name:Folylpolyglutamate synthase, mitochondrial
Type:PROTEIN
Mol. Mass.:64969.76
Organism:Mus musculus
Description:ChEMBL_68680
Residue:587
BDBM50005863
NameBDBM50005863
Synonyms:2-{4-[(2-Amino-4-oxo-3,4-dihydro-pyrido[2,3-d]pyrimidin-6-ylmethyl)-amino]-benzoylamino}-4-sulfo-butyric acid | CHEMBL39175
TypeSmall organic molecule
Emp. Form.C19H20N6O7S
Mol. Mass.476.463
SMILESNc1nc2ncc(CNc3ccc(cc3)C(=O)NC(CCS(O)(=O)=O)C(O)=O)cc2c(=O)[nH]1