Reaction Details
TargetCholecystokinin receptor type A
LigandBDBM50046117
Substrate/Competitorn/a
Meas. Tech.ChEMBL_49724 (CHEMBL661966)
Ki 3200±n/a nM
Citation Corringer, PJWeng, JHDucos, BDurieux, CBoudeau, PBohme, ARoques, BP CCK-B agonist or antagonist activities of structurally hindered and peptidase-resistant Boc-CCK4 derivatives. J Med Chem36:166-72 (1993) Cholecystokinin receptor type A
Name:Cholecystokinin receptor type A
Type:n/a
Mol. Mass.:48229.77
Organism:Cavia porcellus
Description:n/a
Residue:430
BDBM50046117
NameBDBM50046117
Synonyms:3-(2-Amino-3-phenyl-propionylamino)-N-(1-{[1-tert-butoxycarbonyl-2-(1H-indol-3-yl)-ethyl]-methyl-carbamoyl}-2-phenyl-ethyl)-succinamic acid | CHEMBL3351048
TypeSmall organic molecule
Emp. Form.C38H45N5O7
Mol. Mass.683.7932
SMILESCN([C@@H](Cc1c[nH]c2ccccc12)C(=O)OC(C)(C)C)C(=O)[C@H](Cc1ccccc1)NC(=O)[C@H](CC(O)=O)NC(=O)[C@@H](N)Cc1ccccc1