Reaction Details
TargetCholecystokinin receptor type A
LigandBDBM50046126
Substrate/Competitorn/a
Meas. Tech.ChEMBL_48768 (CHEMBL665963)
Ki 2900±n/a nM
Citation Corringer, PJWeng, JHDucos, BDurieux, CBoudeau, PBohme, ARoques, BP CCK-B agonist or antagonist activities of structurally hindered and peptidase-resistant Boc-CCK4 derivatives. J Med Chem36:166-72 (1993) Cholecystokinin receptor type A
Name:Cholecystokinin receptor type A
Type:n/a
Mol. Mass.:48229.77
Organism:Cavia porcellus
Description:n/a
Residue:430
BDBM50046126
NameBDBM50046126
Synonyms:3-(2-Amino-3-phenyl-propionylamino)-N-{1-[1-tert-butoxycarbonyl-2-(1H-indol-3-yl)-ethylcarbamoyl]-pentyl}-succinamic acid | CHEMBL3350335
TypeSmall organic molecule
Emp. Form.C34H45N5O7
Mol. Mass.635.7504
SMILESCCCC[C@H](NC(=O)[C@H](CC(O)=O)NC(=O)[C@@H](N)Cc1ccccc1)C(=O)N[C@H](Cc1c[nH]c2ccccc12)C(=O)OC(C)(C)C