Reaction Details
TargetCholecystokinin receptor type A
LigandBDBM50046124
Substrate/Competitorn/a
Meas. Tech.ChEBML_49724
Ki 4200±n/a nM
Citation Corringer, PJWeng, JHDucos, BDurieux, CBoudeau, PBohme, ARoques, BP CCK-B agonist or antagonist activities of structurally hindered and peptidase-resistant Boc-CCK4 derivatives. J Med Chem36:166-72 (1993) Cholecystokinin receptor type A
Name:Cholecystokinin receptor type A
Type:n/a
Mol. Mass.:48229.77
Organism:Cavia porcellus
Description:n/a
Residue:430
BDBM50046124
NameBDBM50046124
Synonyms:3-(2-Amino-3-naphthalen-2-yl-propionylamino)-N-(1-{[1-tert-butoxycarbonyl-2-(1H-indol-3-yl)-ethyl]-methyl-carbamoyl}-pentyl)-succinamic acid | CHEMBL3351054
TypeSmall organic molecule
Emp. Form.C39H49N5O7
Mol. Mass.699.8357
SMILESCCCC[C@H](NC(=O)[C@H](CC(O)=O)NC(=O)[C@@H](N)Cc1ccc2ccccc2c1)C(=O)N(C)[C@@H](Cc1c[nH]c2ccccc12)C(=O)OC(C)(C)C