Reaction Details
TargetD(2) dopamine receptor
LigandBDBM50037272
Substrate/Competitorn/a
Meas. Tech.ChEBML_60557
Ki 35±n/a nM
Citation Romero, AGLeiby, JAMcCall, RBPiercey, MFSmith, MWHan, F Novel 2-substituted tetrahydro-3H-benz[e]indolamines: highly potent and selective agonists acting at the 5-HT1A receptor as possible anxiolytics and antidepressants. J Med Chem36:2066-74 (1993) D(2) dopamine receptor
Name:D(2) dopamine receptor
Type:Cell-surface receptors
Mol. Mass.:50647.10
Organism:Homo sapiens (Human)
Description:P14416
Residue:443
BDBM50037272
NameBDBM50037272
Synonyms:(R)-8-Dipropylamino-6,7,8,9-tetrahydro-3H-benzo[e]indole-2-carbonitrile | CHEMBL71920
TypeSmall organic molecule
Emp. Form.C19H25N3
Mol. Mass.295.4219
SMILESCCCN(CCC)[C@@H]1CCc2ccc3[nH]c(cc3c2C1)C#N