Reaction Details
TargetMuscarinic acetylcholine receptor M1
LigandBDBM50044698
Substrate/Competitorn/a
Meas. Tech.ChEBML_139962
Ki>10000±n/a nM
Citation Tsukamoto, SIchihara, MWanibuchi, FUsuda, SHidaka, KHarada, MTamura, T Synthesis and structure-activity studies of a series of spirooxazolidine-2,4-diones: 4-oxa analogues of the muscarinic agonist 2-ethyl-8-methyl-2,8-diazaspiro[4.5]decane-1,3-dione. J Med Chem36:2292-9 (1993) Muscarinic acetylcholine receptor M1
Name:Muscarinic acetylcholine receptor M1
Type:Enzyme Catalytic Domain
Mol. Mass.:51390.46
Organism:RAT
Description:P08482
Residue:460
BDBM50044698
NameBDBM50044698
Synonyms:4-(3-Ethyl-2,4-dioxo-1-oxa-3,8-diaza-spiro[4.5]dec-8-yl)-butyric acid methyl ester; hydrochloride | CHEMBL543832
TypeSmall organic molecule
Emp. Form.C14H22N2O5
Mol. Mass.298.3349
SMILESCCN1C(=O)OC2(CCN(CCCC(=O)OC)CC2)C1=O