Reaction Details
TargetDNA topoisomerase 1
LigandBDBM50406999
Substrate/Competitorn/a
Meas. Tech.ChEBML_208261
IC50 48±n/a nM
Citation Wall, MEWani, MCNicholas, AWManikumar, GTele, CMoore, LTruesdale, ALeitner, PBesterman, JM Plant antitumor agents. 30. Synthesis and structure activity of novel camptothecin analogs. J Med Chem36:2689-700 (1993) DNA topoisomerase 1
Name:DNA topoisomerase 1
Type:Enzyme
Mol. Mass.:90771.02
Organism:Homo sapiens (Human)
Description:P11387
Residue:765
BDBM50406999
NameBDBM50406999
Synonyms:CHEMBL2114243
TypeSmall organic molecule
Emp. Form.C21H17N3O6
Mol. Mass.407.3762
SMILESCC[C@@]1(O)C(=O)OCc2c1cc1-c3nc4cc5OCOc5c(N)c4cc3Cn1c2=O