Reaction Details
TargetDNA topoisomerase 1
LigandBDBM50045368
Substrate/Competitorn/a
Meas. Tech.ChEBML_208261
IC50 61±n/a nM
Citation Wall, MEWani, MCNicholas, AWManikumar, GTele, CMoore, LTruesdale, ALeitner, PBesterman, JM Plant antitumor agents. 30. Synthesis and structure activity of novel camptothecin analogs. J Med Chem36:2689-700 (1993) DNA topoisomerase 1
Name:DNA topoisomerase 1
Type:Enzyme
Mol. Mass.:90771.02
Organism:Homo sapiens (Human)
Description:P11387
Residue:765
BDBM50045368
NameBDBM50045368
Synonyms:(20S)-15-chloro-7-ethyl-7-hydroxy-7,8,11,13-tetrahydro-10H-[1,3]dioxolo[5,4-g]pyrano[3',4':6,7]indolizino[1,2-b]quinoline-8,11-dione CHEMBL90636
TypeSmall organic molecule
Emp. Form.C21H15ClN2O6
Mol. Mass.426.807
SMILESCCC1(O)C(=O)OCc2c1cc1-c3nc4cc5OCOc5c(Cl)c4cc3Cn1c2=O