Reaction Details
TargetDNA topoisomerase 1
LigandBDBM50422003
Substrate/Competitorn/a
Meas. Tech.ChEBML_208261
IC50 38±n/a nM
Citation Wall, MEWani, MCNicholas, AWManikumar, GTele, CMoore, LTruesdale, ALeitner, PBesterman, JM Plant antitumor agents. 30. Synthesis and structure activity of novel camptothecin analogs. J Med Chem36:2689-700 (1993) DNA topoisomerase 1
Name:DNA topoisomerase 1
Type:Enzyme
Mol. Mass.:90771.02
Organism:Homo sapiens (Human)
Description:P11387
Residue:765
BDBM50422003
NameBDBM50422003
Synonyms:CHEMBL10741
TypeSmall organic molecule
Emp. Form.C21H18N2O4
Mol. Mass.362.3786
SMILESCC[C@@]1(O)C(=O)OCc2c1cc1-c3nc4cccc(C)c4cc3Cn1c2=O