Reaction Details
TargetLeukotriene B4 receptor 1
LigandBDBM50042152
Substrate/Competitorn/a
Meas. Tech.ChEBML_99839
Ki 1000±n/a nM
Citation Kingsbury, WDPendrak, ILeber, JDBoehm, JCMallet, BSarau, HMFoley, JJSchmidt, DBDaines, RA Synthesis of structural analogs of leukotriene B4 and their receptor binding activity. J Med Chem36:3308-20 (1993) Leukotriene B4 receptor 1
Name:Leukotriene B4 receptor 1
Type:Enzyme Catalytic Domain
Mol. Mass.:37582.68
Organism:Homo sapiens (Human)
Description:Q15722
Residue:352
BDBM50042152
NameBDBM50042152
Synonyms:CHEMBL114454 | Lithium; 3-(2-{6-[3-(3-butoxy-phenyl)-3-hydroxy-propyl]-5,6-dihydro-pyridin-2-yl}-1-hydroxy-ethyl)-benzoate
TypeSmall organic molecule
Emp. Form.C27H30NO5
Mol. Mass.448.5313
SMILESCCCCOc1cccc(c1)C(O)CCc1cccc(CC(O)c2cccc(c2)C([O-])=O)n1