Reaction Details
TargetMuscarinic acetylcholine receptor M2
LigandBDBM50005856
Substrate/Competitorn/a
Meas. Tech.ChEMBL_98894 (CHEMBL703402)
Ki 6.3±n/a nM
Citation Trybulski, EJZhang, JKramss, RHMangano, RM The synthesis and biochemical pharmacology of enantiomerically pure methylated oxotremorine derivatives. J Med Chem36:3533-41 (1994) Muscarinic acetylcholine receptor M2
Name:Muscarinic acetylcholine receptor M2
Type:Enzyme Catalytic Domain
Mol. Mass.:51555.53
Organism:RAT
Description:P10980
Residue:466
BDBM50005856
NameBDBM50005856
Synonyms:1-(4-Dimethylamino-but-2-ynyl)-pyrrolidin-2-one | CHEMBL41779
TypeSmall organic molecule
Emp. Form.C10H16N2O
Mol. Mass.180.2468
SMILESCN(C)CC#CCN1CCCC1=O