Reaction Details
TargetMuscarinic acetylcholine receptor M2
LigandBDBM50004734
Substrate/Competitorn/a
Meas. Tech.ChEMBL_98895 (CHEMBL703403)
Ki 180±n/a nM
Citation Trybulski, EJZhang, JKramss, RHMangano, RM The synthesis and biochemical pharmacology of enantiomerically pure methylated oxotremorine derivatives. J Med Chem36:3533-41 (1994) Muscarinic acetylcholine receptor M2
Name:Muscarinic acetylcholine receptor M2
Type:Enzyme Catalytic Domain
Mol. Mass.:51555.53
Organism:RAT
Description:P10980
Residue:466
BDBM50004734
NameBDBM50004734
Synonyms:CHEMBL310852 N-Methyl-N-(1-methyl-4-pyrrolidin-1-yl-but-2-ynyl)-acetamide (BM 5) N-Methyl-N-(1-methyl-4-pyrrolidin-1-yl-but-2-ynyl)-acetamide (S)
TypeSmall organic molecule
Emp. Form.C12H20N2O
Mol. Mass.208.3
SMILESCC(C#CCN1CCCC1)N(C)C(C)=O